{"text_format":"1","workbook":"xlsx","n_sheets":10,"sheets":["GİRİŞ","ANASAYFA","BORDRO","BANKA LİSTESİ","BİLANÇO","KİŞİ BORDRO","VERGİ MATRAH","DEVAM TAKİP","KAYNAK","TAKVİM"],"not_rendered":{"charts":0,"images":13,"macros":1,"external_links":0,"defined_names":8,"comments":2,"pivot_tables":0},"unopened":[],"bounds":{"document_bytes":16777216,"sheet_cells":100000,"rows_first":2000,"rows_last":500,"rows_between":2000,"halvings":0,"cell_chars":16384,"cell_head_chars":4096},"cells_cut":0,"cells_raw":0,"read":"whole","date_system":"1900"}

{"sheet":"GİRİŞ","index":0,"n_rows":19,"n_cols":17,"rows_kept":19,"cut":false,"hidden":false,"merged":[[1,3,1,7],[17,2,18,2],[6,2,6,7],[0,0,0,7],[5,5,5,6],[5,3,5,4],[2,3,2,7],[15,2,15,7],[3,3,3,7],[4,3,4,7],[5,12,5,13],[15,13,15,14],[18,0,18,1],[17,0,17,1],[17,5,18,7],[10,2,10,7],[11,2,11,7],[12,3,12,7],[16,3,16,7],[13,3,13,7],[7,11,7,12],[8,11,8,12],[8,9,8,10],[7,9,7,10],[10,9,10,10],[7,2,7,7],[5,9,5,10],[12,9,12,10],[15,9,15,10],[13,9,13,10],[14,9,14,10],[16,9,16,10],[8,2,8,7],[9,2,9,7],[11,9,11,10],[6,9,6,14],[7,13,7,14],[8,13,8,14],[9,13,9,14],[10,13,10,14],[14,13,14,14],[9,9,9,10],[13,13,13,14],[0,9,0,10],[0,11,0,14],[3,9,3,10],[3,11,3,14],[1,13,1,14],[2,9,2,10],[2,11,2,14],[1,11,1,12],[18,9,18,10],[18,12,18,13],[9,11,9,12],[10,11,10,12],[11,11,11,12],[12,11,12,12],[13,11,13,12],[14,11,14,12],[15,11,15,12],[16,11,16,12],[17,11,17,12],[16,13,16,14],[17,13,17,14],[11,13,11,14],[17,9,17,10],[12,13,12,14]]}
["ÇOCUK KULÜBÜ İŞLEM ADIMLARI",null,null,null,null,null,null,null,null,"Okul Adı",null,"................... Anaokulu"]
["S.N.","İŞLEM","DÖNEM","ŞABLON (Çift Tıklayınız.)",null,null,null,null,null,"İli","İlçesi","MUĞLA",null,"KÖYCEĞİZ"]
[1,"Okul Aile Birliği Hesabı altında alt hesap açınız.","PLANLAMA ÖNCESİ",null,null,null,null,null,null,"Okul Müdürü"]
[2,"Çocuk Kulübü Yönetim Kurulu ve Etkinlik/Personel Planlaması yaparak olur alınız.\nOlur ekinde kulüpte görev alacak öğretmen/usta öğretici ve personelin yeterlilik evraklarını ekleyiniz","EYLÜL AYI",null,null,null,null,null,null,"Müdür Yardımcısı"]
[3,"Güncel Dönem Maaş Aylık Katsayısı ve Brüt Aylıkları \"Anasayfa\"ya girerek 1 saatlik ücreti belirleyiniz.","OCAK\nTEMMUZ","GÜNCEL KATSAYILAR"]
[4,"Öğrenci kayıtlarını alınız. EK-1, EK-2, EK3 Formlar ile öğrenci özlük föylerini oluşturunuz. E-okul işlemlerini tamamlaynız.","EYLÜL AYI",null,null,null,null,null,null,"1 Saatlik Ücret",null,{"$f":"ANASAYFA!J10","v":17.84},"Günlük Etkinlik Saati",null,{"$f":"ANASAYFA!L6","v":0}]
{"$rows_left_out":14}
{"sheet":"ANASAYFA","index":1,"n_rows":30,"n_cols":22,"rows_kept":30,"cut":false,"hidden":false,"merged":[[19,16,19,19],[20,16,20,19],[21,16,21,19],[22,16,22,19],[22,6,22,7],[16,2,16,5],[16,6,16,7],[16,8,16,9],[20,2,20,5],[20,6,20,7],[17,2,17,5],[17,6,17,7],[18,2,18,5],[18,6,18,7],[21,6,21,7],[22,2,22,5],[19,8,19,9],[20,8,20,9],[17,8,17,9],[18,8,18,9],[21,8,21,9],[19,2,19,5],[19,6,19,7],[26,6,26,7],[29,6,29,7],[27,6,27,7],[23,2,23,5],[23,6,23,7],[29,3,29,5],[29,1,29,2],[27,2,27,5],[25,6,25,7],[2,19,4,19],[1,1,1,21],[7,20,7,21],[2,20,4,21],[2,1,4,2],[5,1,5,2],[2,3,4,4],[2,5,4,6],[5,5,5,6],[5,3,5,4],[2,14,4,14],[2,16,4,16],[7,1,9,2],[7,3,9,4],[7,5,9,6],[7,7,9,8],[9,16,9,18],[2,15,4,15],[2,17,4,17],[2,18,4,18],[9,19,9,21],[8,16,8,18],[8,19,8,21],[5,20,5,21],[2,13,3,13],[10,1,10,2],[10,7,10,8],[5,7,5,8],[5,11,5,12],[2,11,4,12],[5,9,5,10],[2,9,4,10],[2,7,4,8],[7,11,7,13],[8,12,8,13],[9,12,10,13],[9,11,10,11],[7,9,8,10],[9,9,10,10],[10,5,10,6],[10,3,10,4],[17,20,20,21],[15,14,15,15],[16,14,16,15],[17,14,17,15],[18,14,18,15],[19,14,19,15],[29,10,29,11],[23,14,23,15],[24,14,24,15],[25,14,25,15],[26,14,26,15],[27,14,27,15],[28,14,28,15],[23,16,23,19],[24,16,24,19],[20,14,20,15],[25,16,25,19],[26,16,26,19],[27,16,27,19],[28,16,28,19],[15,16,15,19],[16,16,16,19],[17,16,17,19],[18,16,18,19],[21,20,22,21],[25,20,27,20],[24,2,24,5],[24,6,24,7],[21,2,21,5],[28,20,29,20],[25,21,27,21],[28,21,29,21],[23,20,24,21],[29,12,29,19],[21,14,21,15],[22,14,22,15],[25,8,25,9],[26,8,26,9],[27,8,27,9],[28,8,28,9],[23,8,23,9],[24,8,24,9],[26,2,26,5],[22,8,22,9],[29,8,29,9],[28,2,28,5],[28,6,28,7],[25,2,25,5],[7,18,7,19],[7,14,8,15],[10,16,10,18],[10,19,10,21],[9,14,10,15],[12,20,14,21],[15,20,16,21],[13,16,13,19],[12,1,12,19],[15,2,15,5],[13,2,13,5],[13,8,13,9],[14,14,14,15],[13,14,13,15],[13,6,13,7],[14,2,14,5],[14,6,14,7],[14,8,14,9],[15,8,15,9],[15,6,15,7],[14,16,14,19]]}
[]
[null,"ÇOCUK KULÜBÜ MUHASEBE PROGRAMI"]
[null,"Güncel Dönem Maaş Aylık Katsayısı",null,"En Yüksek Devlet Memuru Brüt Aylığı",null,"Güncel Dönem Brüt Asgari Ücret",null,"Gündüz Öğretimi Göstergesi",null,"Kulüpte Yemek Verilecek Mi?",null,"Günlük Etkinlik Saat Sayısı",null,"DÖNEM\nSEÇİNİZ","Kulüp Faaliyeti Yapılan İş Günü","Grup (Sınıf) Sayısı","Toplam Öğrenci Sayısı","%50 İndirimli Çocuk Sayısı","Ücretsiz Faydalanan Çocuk Sayısı","KATSAYILARI\nGÜNCELLE","M. Orhan DURUM\nMuğla - Köyceğiz\norhandurum@gmail.com"]
[]
[null,null,null,null,null,null,null,null,null,null,null,null,null,2023]
[null,0.50979600000000003,null,{"$f":"9500*B6","v":4843.0619999999999},null,13414.5,null,140,null,"Evet",null,null,null,"KASIM",null,null,null,null,null,"       SIFIRLA","               KULLANIM KILAVUZU"]
{"$rows_left_out":25}
{"sheet":"BORDRO","index":2,"n_rows":36,"n_cols":24,"rows_kept":36,"cut":false,"hidden":false,"merged":[[16,13,16,14],[17,13,17,14],[18,13,18,14],[2,1,2,4],[4,1,4,4],[4,6,4,7],[7,6,7,7],[13,1,13,9],[8,6,8,7],[8,8,8,9],[13,10,13,12],[14,12,15,12],[9,10,11,10],[14,13,15,14],[14,10,15,10],[14,11,15,11],[11,11,11,12],[8,1,8,4],[14,4,15,4],[14,7,15,7],[14,9,15,9],[6,6,6,7],[5,8,5,9],[10,11,10,12],[1,22,2,23],[1,5,1,12],[1,1,1,2],[2,8,2,9],[2,11,2,12],[3,8,3,9],[4,8,4,9],[6,8,6,9],[7,8,7,9],[3,1,3,4],[2,6,2,7],[5,1,5,4],[6,1,6,4],[7,1,7,4],[3,6,3,7],[5,6,5,7],[1,15,3,20],[4,20,5,20],[4,17,5,17],[4,19,5,19],[4,18,5,18],[4,16,5,16],[4,15,5,15],[6,15,8,15],[9,8,11,9],[14,1,15,3],[16,1,16,3],[17,1,17,3],[22,1,22,3],[23,1,23,3],[26,1,26,3],[27,1,27,3],[14,5,15,5],[14,6,15,6],[14,8,15,8],[12,1,12,5],[12,6,12,7],[9,1,11,4],[9,5,11,5],[18,1,18,3],[19,1,19,3],[20,1,20,3],[21,1,21,3],[9,6,11,7],[34,18,34,22],[35,18,35,22],[33,18,33,22],[24,13,24,14],[25,13,25,14],[33,7,36,17],[34,2,34,6],[35,2,35,6],[33,2,33,6],[28,1,28,3],[29,1,29,3],[30,1,30,3],[24,1,24,3],[25,1,25,3],[31,13,31,14],[21,13,21,14],[30,13,30,14],[31,1,31,9],[26,13,26,14],[27,13,27,14],[22,13,22,14],[20,13,20,14],[19,13,19,14],[23,13,23,14],[28,13,28,14],[29,13,29,14],[14,15,15,15],[8,23,9,23],[10,22,11,22],[10,23,11,23],[14,23,15,23],[6,20,8,20],[14,22,15,22],[9,20,11,20],[9,19,11,19],[14,20,15,20],[14,21,15,21],[8,22,9,22],[9,18,11,18],[9,15,11,15],[6,17,8,17],[9,17,11,17],[6,18,8,18],[6,19,8,19],[6,16,8,16],[9,16,11,16],[13,13,13,20],[13,21,13,22]]}
[]
[null,"CARİ DÖNEM",null,{"$f":"KAYNAK!G2","v":"KASIM"},{"$f":"KAYNAK!G3","v":"2023"},"GİDER KALEMLERİ ÖZET TABLOSU",null,null,null,null,null,null,null,null,null,"Yönerge Doğrultusunda Görevlendirilebilecek Kişilerin Brüt Ücret Üst Oranları ve Ödenebilecek Brüt Ücret Üst Tutarları",null,null,null,null,null,null,"PERSONEL GİDERLERİ SONRASI TEMEL GİDER KASA DURUMU"]
[null,"GİDER KALEMİ",null,null,null,"Pay","Paydaki Tutar\n(Oransal)",null,"Kullanılabilir Tutar\n(Üst Limite Göre)",null,"Net Ödenen Tutar","Temel gİdere Aktarılan"]
[null,"Temel Giderler",null,null,null,0.33,{"$f":"KAYNAK!$G$15/100*33","v":0},null,{"$f":"G4","v":0},null,{"$f":"I4","v":0},"SGK-Vergi","Limit Üstü",null,null,null,null,null,null,null,null,1,"Oransal Pay",{"$f":"G4","v":0}]
[null,"Kulüp Yönetim Kurulu Başkanı (Müdür)",null,null,null,7.0000000000000007E-2,{"$f":"KAYNAK!$G$15/100*7","v":0},null,{"$f":"SUMIF(E17:E31,KAYNAK!F16,L17:L31)","v":0},null,{"$f":"SUMIF(E17:E31,KAYNAK!F16,X17:X31)","v":0},{"$f":"IF(K5=0,0,G5-K5-M5-IF(U17=\"\",0,U17))","v":0},{"$f":"G5-I5","v":0},null,null,null,"Müdür - Koord. Öğrt.","Müdür Yardımcısı","Kadrolu Öğretmen","Ücretli Usta Öğretici","Temizlik Muhasebe",2,"Üst limitlerden Aktarılan",{"$f":"M10","v":{"$error":"#N/A"}}]
[null,"Kulüp Yönetim Kurulu Bşk. Yrd. (Müdür Yrd.)",null,null,null,0.05,{"$f":"KAYNAK!$G$15/100*5","v":0},null,{"$f":"SUMIF(E17:E31,KAYNAK!F17,L17:L31)+SUMIF(E17:E31,KAYNAK!F18,L17:L31)","v":0},null,{"$f":"(IF(KAYNAK!N53>KAYNAK!K45,0,SUM(SUMIF(E17:CEE31,KAYNAK!F17,X17:X31),(SUMIF(E17:E31,KAYNAK!F18,X17:X31)))))","v":{"$error":"#N/A"}},{"$f":"IF(K6=0,0,I6-K6-IF(U18=\"\",0,U18))","v":{"$error":"#N/A"}},{"$f":"IF(K6=0,G6,G6-I6)","v":{"$error":"#N/A"}},null,null,null,null,null,null,null,null,3,"SGK/Vergi Kişi Kesinti",{"$f":"L10","v":{"$error":"#N/A"}}]
{"$rows_left_out":31}
{"sheet":"BANKA LİSTESİ","index":3,"n_rows":26,"n_cols":10,"rows_kept":26,"cut":false,"hidden":false,"merged":[[9,9,9,10],[7,2,7,5],[7,6,7,8],[7,9,7,10],[8,2,8,5],[8,6,8,8],[8,9,8,10],[2,2,2,10],[1,2,1,10],[4,2,4,10],[19,2,19,5],[19,6,19,8],[19,9,19,10],[17,2,17,5],[17,6,17,8],[17,9,17,10],[18,2,18,5],[18,6,18,8],[10,2,10,5],[10,6,10,8],[10,9,10,10],[14,2,14,5],[14,6,14,8],[25,7,25,10],[24,7,24,10],[18,9,18,10],[15,2,15,5],[15,6,15,8],[15,9,15,10],[16,2,16,5],[16,6,16,8],[16,9,16,10],[25,2,25,5],[20,2,20,5],[20,6,20,8],[20,9,20,10],[21,1,21,8],[23,7,23,10],[23,2,23,5],[3,2,3,10],[14,9,14,10],[11,2,11,5],[11,6,11,8],[11,9,11,10],[12,2,12,5],[12,6,12,8],[12,9,12,10],[6,2,6,5],[6,6,6,8],[6,9,6,10],[5,2,5,5],[5,6,5,8],[5,9,5,10],[9,2,9,5],[9,6,9,8],[24,2,24,5],[21,9,21,10],[13,2,13,5],[13,6,13,8],[13,9,13,10]]}
[]
[null,null,"T.C."]
[null,null,{"$f":"CONCATENATE(KAYNAK!N106,\" \",\"KAYMAKAMLIĞI\")","v":"KÖYCEĞİZ KAYMAKAMLIĞI"}]
[null,null,{"$f":"KAYNAK!L106","v":"KÖYCEĞİZ ANAOKULU"}]
[null,null,{"$f":"CONCATENATE(KAYNAK!G3,\" \",\"YILI\",\" \",KAYNAK!G2,\" \",\"AYI\",\" \",\"ÇOCUK KULÜBÜ\",\" \",\"BANKA LİSTESİ\")","v":"2023 YILI KASIM AYI ÇOCUK KULÜBÜ BANKA LİSTESİ"}]
[null,"S.N.","PERSONEL ADI",null,null,null,"IBAN",null,null,"Tutar"]
{"$rows_left_out":21}
{"sheet":"BİLANÇO","index":4,"n_rows":52,"n_cols":14,"rows_kept":52,"cut":false,"hidden":false,"merged":[[6,12,7,13],[4,2,4,13],[16,2,16,9],[3,2,3,13],[2,2,2,13],[1,2,1,13],[8,2,8,3],[8,4,8,5],[8,6,8,7],[8,8,8,9],[8,10,8,11],[6,2,7,3],[6,4,7,5],[6,6,7,7],[6,8,7,9],[6,10,7,11],[8,12,8,13],[12,2,12,3],[12,4,12,5],[12,6,12,7],[12,8,12,9],[12,10,12,11],[12,12,12,13],[10,2,11,3],[22,2,22,9],[23,2,23,9],[17,2,17,9],[18,2,18,9],[19,2,19,9],[20,2,20,9],[20,12,20,13],[18,10,18,11],[18,12,18,13],[0,2,0,3],[0,4,0,5],[34,2,34,10],[35,2,35,10],[10,4,11,5],[10,6,11,7],[10,8,11,9],[10,10,11,11],[10,12,11,13],[24,2,24,13],[21,10,21,11],[21,12,21,13],[22,10,22,11],[22,12,22,13],[23,10,23,11],[23,12,23,13],[16,10,16,11],[16,12,16,13],[17,10,17,11],[17,12,17,13],[19,10,19,11],[19,12,19,13],[20,10,20,11],[21,2,21,9],[25,7,25,8],[36,11,36,13],[38,11,38,13],[27,2,27,6],[35,11,35,13],[28,9,28,10],[29,9,29,10],[31,2,31,10],[37,2,37,10],[37,11,37,13],[28,7,28,8],[29,7,29,8],[30,7,30,8],[28,11,28,12],[29,11,29,12],[30,11,30,12],[31,11,31,12],[25,2,25,6],[25,9,25,10],[15,2,15,9],[15,10,15,11],[15,12,15,13],[14,2,14,13],[50,10,50,13],[51,10,51,13],[50,2,50,5],[51,2,51,5],[43,2,43,10],[38,2,38,10],[43,11,43,13],[44,2,44,10],[44,11,44,13],[45,2,45,10],[45,11,45,13],[39,2,39,10],[39,11,39,13],[36,2,36,10],[33,2,33,13],[30,2,30,6],[40,2,40,10],[25,11,25,12],[26,11,26,12],[27,11,27,12],[49,2,49,5],[49,10,49,13],[46,2,46,10],[46,11,46,13],[47,2,47,10],[47,11,47,13],[28,2,28,6],[29,2,29,6],[26,9,26,10],[26,2,26,6],[34,11,34,13],[30,9,30,10],[27,9,27,10],[26,7,26,8],[27,7,27,8],[42,2,42,13],[40,11,40,13],[32,2,32,10],[32,11,32,13]]}
[null,null,{"$f":"BORDRO!D2","v":"KASIM"},null,{"$f":"BORDRO!E2","v":"2023"}]
[null,null,"T.C."]
[null,null,{"$f":"CONCATENATE(KAYNAK!N106,\" \",\"KAYMAKAMLIĞI\")","v":"KÖYCEĞİZ KAYMAKAMLIĞI"}]
[null,null,{"$f":"KAYNAK!L106","v":"KÖYCEĞİZ ANAOKULU"}]
[null,null,{"$f":"CONCATENATE(KAYNAK!G3,\" \",\"YILI\",\" \",KAYNAK!G2,\" \",\"AYI\",\" \",\"ÇOCUK\",\" \",\"KULÜBÜ\",\" \",\"BİLANÇOSU\")","v":"2023 YILI KASIM AYI ÇOCUK KULÜBÜ BİLANÇOSU"}]
[]
{"$rows_left_out":47}
{"sheet":"KİŞİ BORDRO","index":5,"n_rows":34,"n_cols":15,"rows_kept":34,"cut":false,"hidden":false,"merged":[[21,5,21,9],[20,2,20,4],[13,2,13,4],[15,2,15,4],[15,5,15,9],[16,5,16,9],[13,5,13,9],[17,5,17,9],[18,5,18,9],[19,5,19,9],[20,5,20,9],[16,2,16,4],[17,2,17,4],[18,2,18,4],[19,2,19,4],[21,2,21,4],[22,2,22,4],[23,2,23,4],[32,7,32,9],[22,5,22,9],[23,5,23,9],[27,5,27,9],[27,2,27,4],[25,2,25,4],[25,5,25,9],[26,2,26,4],[26,5,26,9],[28,2,28,4],[28,5,28,9],[24,2,24,4],[24,5,24,9],[33,7,33,9],[32,2,32,4],[33,2,33,4],[29,5,29,9],[29,2,29,4],[9,11,10,12],[1,1,1,2],[9,2,9,4],[10,2,10,4],[11,2,11,4],[7,2,7,9],[6,2,6,9],[5,2,5,9],[4,2,4,9],[9,5,9,9],[10,5,10,9],[11,5,11,9],[14,2,14,4],[14,5,14,9],[12,2,12,4],[12,5,12,9],[11,11,11,12]]}
[]
[null,"BORDRO DÖNEMİ",null,{"$f":"KAYNAK!G3","v":"2023"},{"$f":"KAYNAK!G2","v":"KASIM"}]
[]
[]
[null,null,"T.C."]
[null,null,{"$f":"CONCATENATE(KAYNAK!N106,\" \",\"KAYMAKAMLIĞI\")","v":"KÖYCEĞİZ KAYMAKAMLIĞI"}]
{"$rows_left_out":29}
{"sheet":"VERGİ MATRAH","index":6,"n_rows":36,"n_cols":11,"rows_kept":36,"cut":false,"hidden":false,"merged":[[24,5,24,7],[25,5,25,7],[22,5,22,7],[23,5,23,7],[17,5,17,7],[18,5,18,7],[19,5,19,7],[20,5,20,7],[21,5,21,7],[30,1,31,11],[32,1,32,5],[34,7,34,11],[35,7,35,11],[26,5,26,7],[25,2,25,4],[26,2,26,4],[12,2,12,4],[24,2,24,4],[23,2,23,4],[22,2,22,4],[13,2,13,4],[20,2,20,4],[21,2,21,4],[18,2,18,4],[19,2,19,4],[14,2,14,4],[16,2,16,4],[17,2,17,4],[1,1,1,3],[7,1,8,11],[16,5,16,7],[10,5,11,7],[12,5,12,7],[13,5,13,7],[10,1,11,1],[10,2,11,4],[15,2,15,4],[12,8,12,9],[13,8,13,9],[14,5,14,7],[15,5,15,7],[14,8,14,9],[4,14,6,16],[4,1,4,11],[5,1,5,11],[6,1,6,11],[10,8,11,9],[10,10,11,11],[22,10,22,11],[23,10,23,11],[24,10,24,11],[12,10,12,11],[13,10,13,11],[14,10,14,11],[15,10,15,11],[16,10,16,11],[17,10,17,11],[18,10,18,11],[19,10,19,11],[25,10,25,11],[26,10,26,11],[15,8,15,9],[16,8,16,9],[17,8,17,9],[18,8,18,9],[19,8,19,9],[20,8,20,9],[21,8,21,9],[22,8,22,9],[23,8,23,9],[24,8,24,9],[25,8,25,9],[26,8,26,9],[20,10,20,11],[21,10,21,11]]}
[]
[null,"MATRAH DÖNEMİ",null,null,{"$f":"KAYNAK!G3","v":"2023"},{"$f":"KAYNAK!G2","v":"KASIM"}]
[]
[]
[null,"T.C."]
[null,{"$f":"CONCATENATE(KAYNAK!N106,\" \",\"KAYMAKAMLIĞI\")","v":"KÖYCEĞİZ KAYMAKAMLIĞI"}]
{"$rows_left_out":31}
{"sheet":"DEVAM TAKİP","index":7,"n_rows":28,"n_cols":110,"rows_kept":28,"cut":false,"hidden":false,"merged":[[2,43,2,46],[3,43,5,46],[27,4,27,6],[27,8,27,13],[3,42,5,42],[23,29,23,46],[9,43,9,46],[10,43,10,46],[21,1,21,26],[7,43,7,46],[3,1,5,1],[3,2,4,2],[3,3,4,41],[27,14,27,17],[27,19,27,23],[27,24,27,28],[20,43,20,46],[15,43,15,46],[16,43,16,46],[17,43,17,46],[18,43,18,46],[23,2,23,3],[24,2,24,3],[24,29,24,46],[1,3,1,30],[1,31,1,34],[21,43,21,46],[8,43,8,46],[19,43,19,46],[11,43,11,46],[12,43,12,46],[13,43,13,46],[14,43,14,46],[1,43,1,46],[1,1,2,2],[6,43,6,46],[21,27,21,34]]}
[]
[null,{"$f":"KAYNAK!L106","v":"KÖYCEĞİZ ANAOKULU"},null,"ÇOCUK KULÜBÜ AYLIK İCMALİ",null,null,null,null,null,null,null,null,null,null,null,null,null,null,null,null,null,null,null,null,null,null,null,null,null,null,null,"DÖNEMİ",null,null,null,null,null,null,null,null,null,null,{"$f":"KAYNAK!G3","v":"2023"},{"$f":"BORDRO!D2","v":"KASIM"}]
[null,null,null,null,null,null,null,null,null,null,null,null,null,null,null,null,null,null,null,null,null,null,null,null,null,null,null,null,null,null,null,null,null,null,null,null,null,null,null,null,null,null,"BÜTÇE YILI",{"$f":"BORDRO!E2","v":"2023"}]
[null,"Sıra No ","Öğretmenin",{"$f":"CONCATENATE(AQ2,\" \",\"YILI\",\" \",AR2,\" \",\"DÖNEMİ\",\" \",C2,\" \",\"ÇOCUK KULÜBÜ\",\" \",\"AYLIK İCMALİ\")","v":"2023 YILI KASIM DÖNEMİ  ÇOCUK KULÜBÜ AYLIK İCMALİ"},null,null,null,null,null,null,null,null,null,null,null,null,null,null,null,null,null,null,null,null,null,null,null,null,null,null,null,null,null,null,null,null,null,null,null,null,null,null,"Aylık Okuttuğu Ders Toplamı","İmzası"]
[]
[null,null,"Adı Soyadı","Görevi",{"$f":"TAKVİM!I2","v":"2023-11-01"},{"$f":"IF(E6<VLOOKUP(TAKVİM!$F$2,TAKVİM!$F$6:$H$101,3,0),'DEVAM TAKİP'!E6+1,\"\")","v":"2023-11-02"},{"$f":"IF(F6<VLOOKUP(TAKVİM!$F$2,TAKVİM!$F$6:$H$101,3,0),'DEVAM TAKİP'!F6+1,\"\")","v":"2023-11-03"},{"$f":"IF(G6<VLOOKUP(TAKVİM!$F$2,TAKVİM!$F$6:$H$101,3,0),'DEVAM TAKİP'!G6+1,\"\")","v":"2023-11-04"},{"$f":"IF(H6<VLOOKUP(TAKVİM!$F$2,TAKVİM!$F$6:$H$101,3,0),'DEVAM TAKİP'!H6+1,\"\")","v":"2023-11-05"},{"$f":"IF(I6<VLOOKUP(TAKVİM!$F$2,TAKVİM!$F$6:$H$101,3,0),'DEVAM TAKİP'!I6+1,\"\")","v":"2023-11-06"},{"$f":"IF(J6<VLOOKUP(TAKVİM!$F$2,TAKVİM!$F$6:$H$101,3,0),'DEVAM TAKİP'!J6+1,\"\")","v":"2023-11-07"},{"$f":"IF(K6<VLOOKUP(TAKVİM!$F$2,TAKVİM!$F$6:$H$101,3,0),'DEVAM TAKİP'!K6+1,\"\")","v":"2023-11-08"},{"$f":"IF(L6<VLOOKUP(TAKVİM!$F$2,TAKVİM!$F$6:$H$101,3,0),'DEVAM TAKİP'!L6+1,\"\")","v":"2023-11-09"},{"$f":"IF(M6<VLOOKUP(TAKVİM!$F$2,TAKVİM!$F$6:$H$101,3,0),'DEVAM TAKİP'!M6+1,\"\")","v":"2023-11-10"},{"$f":"IF(N6<VLOOKUP(TAKVİM!$F$2,TAKVİM!$F$6:$H$101,3,0),'DEVAM TAKİP'!N6+1,\"\")","v":"2023-11-11"},{"$f":"IF(O6<VLOOKUP(TAKVİM!$F$2,TAKVİM!$F$6:$H$101,3,0),'DEVAM TAKİP'!O6+1,\"\")","v":"2023-11-12"},{"$f":"IF(P6<VLOOKUP(TAKVİM!$F$2,TAKVİM!$F$6:$H$101,3,0),'DEVAM TAKİP'!P6+1,\"\")","v":"2023-11-13"},{"$f":"IF(Q6<VLOOKUP(TAKVİM!$F$2,TAKVİM!$F$6:$H$101,3,0),'DEVAM TAKİP'!Q6+1,\"\")","v":"2023-11-14"},{"$f":"IF(R6<VLOOKUP(TAKVİM!$F$2,TAKVİM!$F$6:$H$101,3,0),'DEVAM TAKİP'!R6+1,\"\")","v":"2023-11-15"},{"$f":"IF(S6<VLOOKUP(TAKVİM!$F$2,TAKVİM!$F$6:$H$101,3,0),'DEVAM TAKİP'!S6+1,\"\")","v":"2023-11-16"},{"$f":"IF(T6<VLOOKUP(TAKVİM!$F$2,TAKVİM!$F$6:$H$101,3,0),'DEVAM TAKİP'!T6+1,\"\")","v":"2023-11-17"},{"$f":"IF(U6<VLOOKUP(TAKVİM!$F$2,TAKVİM!$F$6:$H$101,3,0),'DEVAM TAKİP'!U6+1,\"\")","v":"2023-11-18"},{"$f":"IF(V6<VLOOKUP(TAKVİM!$F$2,TAKVİM!$F$6:$H$101,3,0),'DEVAM TAKİP'!V6+1,\"\")","v":"2023-11-19"},{"$f":"IF(W6<VLOOKUP(TAKVİM!$F$2,TAKVİM!$F$6:$H$101,3,0),'DEVAM TAKİP'!W6+1,\"\")","v":"2023-11-20"},{"$f":"IF(X6<VLOOKUP(TAKVİM!$F$2,TAKVİM!$F$6:$H$101,3,0),'DEVAM TAKİP'!X6+1,\"\")","v":"2023-11-21"},{"$f":"IF(Y6<VLOOKUP(TAKVİM!$F$2,TAKVİM!$F$6:$H$101,3,0),'DEVAM TAKİP'!Y6+1,\"\")","v":"2023-11-22"},{"$f":"IF(Z6<VLOOKUP(TAKVİM!$F$2,TAKVİM!$F$6:$H$101,3,0),'DEVAM TAKİP'!Z6+1,\"\")","v":"2023-11-23"},{"$f":"IF(AA6<VLOOKUP(TAKVİM!$F$2,TAKVİM!$F$6:$H$101,3,0),'DEVAM TAKİP'!AA6+1,\"\")","v":"2023-11-24"},{"$f":"IF(AB6<VLOOKUP(TAKVİM!$F$2,TAKVİM!$F$6:$H$101,3,0),'DEVAM TAKİP'!AB6+1,\"\")","v":"2023-11-25"},{"$f":"IF(AC6<VLOOKUP(TAKVİM!$F$2,TAKVİM!$F$6:$H$101,3,0),'DEVAM TAKİP'!AC6+1,\"\")","v":"2023-11-26"},{"$f":"IF(AD6<VLOOKUP(TAKVİM!$F$2,TAKVİM!$F$6:$H$101,3,0),'DEVAM TAKİP'!AD6+1,\"\")","v":"2023-11-27"},{"$f":"IF(AE6<VLOOKUP(TAKVİM!$F$2,TAKVİM!$F$6:$H$101,3,0),'DEVAM TAKİP'!AE6+1,\"\")","v":"2023-11-28"},{"$f":"IF(AF6<VLOOKUP(TAKVİM!$F$2,TAKVİM!$F$6:$H$101,3,0),'DEVAM TAKİP'!AF6+1,\"0\")","v":"2023-11-29"},{"$f":"IF(AG6<VLOOKUP(TAKVİM!$F$2,TAKVİM!$F$6:$H$101,3,0),'DEVAM TAKİP'!AG6+1,\"0\")","v":"2023-11-30"},{"$f":"IF(AH6<VLOOKUP(TAKVİM!$F$2,TAKVİM!$F$6:$H$101,3,0),'DEVAM TAKİP'!AH6+1,\"0\")","v":"0"},{"$f":"IF(AI6<VLOOKUP(TAKVİM!$F$2,TAKVİM!$F$6:$H$101,3,0),'DEVAM TAKİP'!AI6+1,\"0\")","v":"0"},{"$f":"IF(AJ6<VLOOKUP(TAKVİM!$F$2,TAKVİM!$F$6:$H$101,3,0),'DEVAM TAKİP'!AJ6+1,\"0\")","v":"0"},{"$f":"IF(AK6<VLOOKUP(TAKVİM!$F$2,TAKVİM!$F$6:$H$101,3,0),'DEVAM TAKİP'!AK6+1,\"0\")","v":"0"},{"$f":"IF(AL6<VLOOKUP(TAKVİM!$F$2,TAKVİM!$F$6:$H$101,3,0),'DEVAM TAKİP'!AL6+1,\"0\")","v":"0"},{"$f":"IF(AM6<VLOOKUP(TAKVİM!$F$2,TAKVİM!$F$6:$H$101,3,0),'DEVAM TAKİP'!AM6+1,\"0\")","v":"0"},{"$f":"IF(AN6<VLOOKUP(TAKVİM!$F$2,TAKVİM!$F$6:$H$101,3,0),'DEVAM TAKİP'!AN6+1,\"0\")","v":"0"},{"$f":"IF(AO6<VLOOKUP(TAKVİM!$F$2,TAKVİM!$F$6:$H$101,3,0),'DEVAM TAKİP'!AO6+1,\"0\")","v":"0"}]
{"$rows_left_out":23}
{"sheet":"KAYNAK","index":8,"n_rows":995,"n_cols":69,"rows_kept":995,"cut":false,"hidden":true,"merged":[[436,45,436,46],[529,22,529,31],[304,34,305,34],[304,39,305,39],[304,40,305,40],[304,41,305,41],[306,21,306,23],[304,28,305,28],[304,29,305,29],[304,30,305,30],[304,31,305,31],[304,32,305,33],[304,21,305,23],[304,24,305,24],[304,25,305,25],[304,26,305,26],[71,2,71,3],[0,8,2,14],[50,4,50,5],[67,0,67,1],[69,0,69,1],[70,2,70,3],[57,0,57,1],[4,9,4,11],[15,0,15,2],[20,0,20,2],[24,0,24,2],[41,6,41,13],[475,1,475,12],[435,26,435,30],[436,28,436,29],[72,7,72,11],[73,7,73,9],[73,11,73,13],[319,21,320,28],[304,27,305,27],[276,7,276,14],[258,9,258,12],[332,1,332,5],[476,43,476,44],[477,31,477,33],[477,43,477,44],[478,31,478,33],[478,43,478,44],[476,31,476,33],[484,31,484,33],[484,43,484,44],[482,31,482,33],[479,43,479,44],[480,31,480,33],[480,43,480,44],[481,31,481,33],[481,43,481,44],[479,31,479,33],[5,42,5,44],[488,43,488,44],[489,31,489,33],[489,43,489,44],[490,31,490,33],[490,43,490,44],[488,31,488,33],[485,43,485,44],[486,31,486,33],[486,43,486,44],[487,31,487,33],[487,43,487,44],[485,31,485,33],[482,43,482,44],[483,31,483,33],[483,43,483,44]]}
[null,null,0,0,null,null,"SEÇİLİ AY",null,"BU SAYFADA DEĞİŞİKLİK YAPMAYINIZ.",null,null,null,null,null,null,null,null,null,null,null,null,null,null,null,null,null,null,0]
[null,"Evet",1,1,null,"EYLÜL",{"$f":"ANASAYFA!N6","v":"KASIM"},null,null,null,null,null,null,null,null,null,null,null,null,null,null,null,null,null,null,null,null,1]
[null,"Hayır",2,2,null,"EKİM",{"$f":"CONCATENATE(ANASAYFA!N5)","v":"2023"},null,null,null,null,null,null,null,null,null,null,null,null,null,null,null,null,null,null,null,null,2]
[null,null,3,3,null,"KASIM",null,null,null,null,null,null,null,null,null,null,null,null,null,null,null,null,null,null,null,null,null,3]
[{"$f":"IF(ANASAYFA!J6:K6=KAYNAK!B2,4,IF(ANASAYFA!J6:K6=KAYNAK!B3,6))","v":4},false,4,4,null,"ARALIK","SEÇİLİ AY İŞ GÜNÜ",null,null,"Öğretmen Listesi ayrı",null,null,null,null,null,null,null,null,null,null,null,null,null,null,null,null,null,4]
[null,null,5,5,null,"OCAK",{"$f":"ANASAYFA!O6","v":0},null,null,null,null,null,null,null,null,null,null,null,null,null,null,null,null,null,null,null,null,5,null,null,null,null,null,null,null,null,null,null,null,null,null,null,"ghs-yhs ders saatleri"]
{"$rows_left_out":990}
{"sheet":"TAKVİM","index":9,"n_rows":412,"n_cols":36,"rows_kept":412,"cut":false,"hidden":true,"merged":[]}
[null,null,null,"seçili ay","seçili yıl","birleştir",null,null,"seçili tarih ilk gün",null,null,null,"Seçili Yıl",null,"formül"]
[null,null,null,{"$f":"ANASAYFA!N6","v":"KASIM"},{"$f":"ANASAYFA!N5","v":2023},{"$f":"CONCATENATE(D2,E2)","v":"KASIM2023"},null,null,{"$f":"VLOOKUP(F2,F6:H101,2,0)","v":"2023-11-01"},null,null,null,{"$f":"ANASAYFA!N5","v":2023},null,{"$f":"IF($M$2=$L$6,M6,IF($M$2=$L$7,M7,IF($M$2=$L$8,M8,IF($M$2=$L$9,M9,IF($M$2=$L$10,M10,IF($M$2=$L$11,M11,IF($M$2=$L$12,M12,IF($M$2=$L$13,M13))))))))","v":22}]
[]
[]
[null,"eğer",null,"ay","yıl","birleştir",null,null,null,null,null,null,"Ocak","Şubat","mart","Nisan","Mayıs","Haziran","Temmuz","Ağustos","Eylül","Ekim","Kasım","Aralık"]
[null,{"$f":"IF(D6=\"\",\"\",D6)","v":"Ocak"},1,"Ocak",2023,{"$f":"CONCATENATE(D6,E6)","v":"Ocak2023"},{"$f":"DATE(E6,C6,1)","v":"2023-01-01"},{"$f":"EOMONTH(G6,0)","v":"2023-01-31"},{"$f":"NETWORKDAYS(G6,H6)","v":22},null,null,2023,22,20,23,15,23,22,21,23,21,22,17,21]
{"$rows_left_out":406}